{"text_format":"1","workbook":"xlsx","n_sheets":4,"sheets":["DataEntry","StockMovements","Catalogue","DataOptions"],"not_rendered":{"charts":0,"images":2,"macros":1,"external_links":0,"defined_names":1,"comments":0,"pivot_tables":3},"unopened":[],"bounds":{"document_bytes":16777216,"sheet_cells":100000,"rows_first":2000,"rows_last":500,"rows_between":2000,"halvings":0,"cell_chars":16384,"cell_head_chars":4096},"cells_cut":0,"cells_raw":0,"read":"whole","date_system":"1900"}

{"sheet":"DataEntry","index":0,"n_rows":16,"n_cols":9,"rows_kept":16,"cut":false,"hidden":false,"merged":[[8,0,8,1],[8,3,8,4],[8,6,8,7],[4,0,4,1]]}
[]
["Ημερομηνία","Κίνηση","Κωδικός","Περιγραφή","Προμηθευτής","Ποσότητα","Αξία","Σύνολο"]
[null,null,null,{"$f":"IFERROR(VLOOKUP(C3,Catalogue!A:D,2,0),\"\")","v":""},{"$f":"IFERROR(VLOOKUP(C3,Catalogue!A:D,3,0),\"\")","v":""},null,{"$f":"IFERROR(VLOOKUP(C3,Catalogue!A:D,4,0),\"\")","v":""},{"$f":"IFERROR(IF(B3=\"Εισαγωγή\",G3*F3,IF(B3=\"Εξαγωγή\",F3*G3*-1,\"\")),0)","v":""},{"$f":"IF(B3=\"Εισαγωγή\",F3,F3*-1)","v":0}]
[]
["Επικοινωνία στο saloustros@outlook.com"]
[]
[]
[]
["Υπόλοιπο Αποθήκης",null,null,"Αγορές ανά Προμηθευτή",null,null,"Αξία Αποθήκης"]
["Κίνηση","(Πολλά στοιχεία)",null,"Κίνηση","Εισαγωγή",null,"Κίνηση","(Πολλά στοιχεία)"]
["Ημερομηνία","(Όλα)",null,"Ημερομηνία","(Όλα)",null,"Ημερομηνία","(Όλα)"]
[]
["Ετικέτες γραμμής","Άθροισμα από Κίνηση Αποθήκης",null,"Ετικέτες γραμμής","Άθροισμα από Συνολική αξία",null,"Ετικέτες γραμμής","Άθροισμα από Συνολική αξία"]
["Πορτοφόλι Κίτρινο",0,null,"Alpha",24,null,"Πορτοφόλι Κίτρινο",0]
["Πορτοφόλι Κόκκινο",2,null,"Beta",100,null,"Πορτοφόλι Κόκκινο",40]
["Γενικό άθροισμα",2,null,"Γενικό άθροισμα",124,null,"Γενικό άθροισμα",40]

{"sheet":"StockMovements","index":1,"n_rows":5,"n_cols":9,"rows_kept":5,"cut":false,"hidden":false,"merged":[]}
["Ημερομηνία","Κίνηση","Κωδικός","Περιγραφή","Προμηθευτής","Ποσότητα","Αξία μονάδας","Συνολική αξία","Κίνηση Αποθήκης"]
["2015-01-01","Εισαγωγή",1,"Πορτοφόλι Κίτρινο","Alpha",2,12,24,2]
["2015-02-01","Εισαγωγή",2,"Πορτοφόλι Κόκκινο","Beta",5,20,100,5]
["2015-04-03","Εξαγωγή",2,"Πορτοφόλι Κόκκινο","Beta",3,20,-60,-3]
["2015-01-03","Εξαγωγή",1,"Πορτοφόλι Κίτρινο","Alpha",2,12,-24,-2]

{"sheet":"Catalogue","index":2,"n_rows":5,"n_cols":4,"rows_kept":5,"cut":false,"hidden":false,"merged":[]}
["Κωδικός","Περιγραφή","Προμηθευτής","Αξία μονάδας"]
[1,"Πορτοφόλι Κίτρινο","Alpha",12]
[2,"Πορτοφόλι Κόκκινο","Beta",20]
[3,"Πορτοφόλι Μπλέ","Beta",12]
[4,"Τσάντα Κίτρινη","Alpha",12]

{"sheet":"DataOptions","index":3,"n_rows":2,"n_cols":1,"rows_kept":2,"cut":false,"hidden":true,"merged":[]}
["Εισαγωγή"]
["Εξαγωγή"]